{"text_format":"1","workbook":"xlsx","n_sheets":12,"sheets":["Startseite","Schadstoffkonzentrationen Boden","Tabelle1","Schadstoffkonzentrationen GW","Bodencharakterisierung","Grundwassercharakterisierung","Sanierungsdesign","Schadstoffbelastung","Calculation","Berechnung1","Stoffdatenbank","Heterogenität"],"not_rendered":{"charts":5,"images":33,"macros":1,"external_links":1,"defined_names":54,"comments":0,"pivot_tables":0},"unopened":[],"bounds":{"document_bytes":16777216,"sheet_cells":100000,"rows_first":2000,"rows_last":500,"rows_between":2000,"halvings":0,"cell_chars":16384,"cell_head_chars":4096},"cells_cut":0,"cells_raw":0,"read":"whole","date_system":"1900"}

{"sheet":"Startseite","index":0,"n_rows":5,"n_cols":13,"rows_kept":5,"cut":false,"hidden":false,"merged":[]}
[]
["Berechnung der Sanierungsdauer",null,null,null,null,null,null,null,null,null,null,"Excel-Version",{"$f":"INFO(\"version\")","v":"16.0"}]
["  In-Situ Chemische Oxidation (ISCO)"]
[]
["  Version 1.1"]

{"sheet":"Schadstoffkonzentrationen Boden","index":1,"n_rows":126,"n_cols":29,"rows_kept":126,"cut":false,"hidden":true,"merged":[[22,25,24,25],[23,26,25,26],[76,25,77,25],[76,26,77,26],[76,27,77,27],[76,28,77,28],[0,0,0,21],[20,0,20,21],[22,21,23,21],[25,0,25,21],[40,0,40,21],[68,0,68,21],[60,0,60,21],[75,0,75,20],[76,0,77,0],[22,22,24,22],[22,23,24,23],[22,24,24,24],[76,22,77,22],[76,23,77,23],[75,21,125,21],[78,0,78,20],[76,24,77,24],[93,0,93,20],[121,0,121,20],[113,0,113,20]]}
[]
[]
[]
[]
[]
[]
{"$rows_left_out":121}
{"sheet":"Tabelle1","index":2,"n_rows":9,"n_cols":21,"rows_kept":9,"cut":false,"hidden":true,"merged":[]}
["LCKW",{"$f":"'Schadstoffkonzentrationen Boden'!B93","v":""},{"$f":"'Schadstoffkonzentrationen Boden'!C93","v":""},{"$f":"'Schadstoffkonzentrationen Boden'!D93","v":""},{"$f":"'Schadstoffkonzentrationen Boden'!E93","v":""},{"$f":"'Schadstoffkonzentrationen Boden'!F93","v":""},{"$f":"'Schadstoffkonzentrationen Boden'!G93","v":""},{"$f":"'Schadstoffkonzentrationen Boden'!H93","v":""},{"$f":"'Schadstoffkonzentrationen Boden'!I93","v":""},{"$f":"'Schadstoffkonzentrationen Boden'!J93","v":""},{"$f":"'Schadstoffkonzentrationen Boden'!K93","v":""},{"$f":"'Schadstoffkonzentrationen Boden'!L93","v":""},{"$f":"'Schadstoffkonzentrationen Boden'!M93","v":""},{"$f":"'Schadstoffkonzentrationen Boden'!N93","v":""},{"$f":"'Schadstoffkonzentrationen Boden'!O93","v":""},{"$f":"'Schadstoffkonzentrationen Boden'!P93","v":""},{"$f":"'Schadstoffkonzentrationen Boden'!Q93","v":""},{"$f":"'Schadstoffkonzentrationen Boden'!R93","v":""},{"$f":"'Schadstoffkonzentrationen Boden'!S93","v":""},{"$f":"'Schadstoffkonzentrationen Boden'!T93","v":""},{"$f":"'Schadstoffkonzentrationen Boden'!U93","v":""}]
["AKW",{"$f":"'Schadstoffkonzentrationen Boden'!B60","v":""},{"$f":"'Schadstoffkonzentrationen Boden'!C60","v":""},{"$f":"'Schadstoffkonzentrationen Boden'!D60","v":""},{"$f":"'Schadstoffkonzentrationen Boden'!E60","v":""},{"$f":"'Schadstoffkonzentrationen Boden'!F60","v":""},{"$f":"'Schadstoffkonzentrationen Boden'!G60","v":""},{"$f":"'Schadstoffkonzentrationen Boden'!H60","v":""},{"$f":"'Schadstoffkonzentrationen Boden'!I60","v":""},{"$f":"'Schadstoffkonzentrationen Boden'!J60","v":""},{"$f":"'Schadstoffkonzentrationen Boden'!K60","v":""},{"$f":"'Schadstoffkonzentrationen Boden'!L60","v":""},{"$f":"'Schadstoffkonzentrationen Boden'!M60","v":""},{"$f":"'Schadstoffkonzentrationen Boden'!N60","v":""},{"$f":"'Schadstoffkonzentrationen Boden'!O60","v":""},{"$f":"'Schadstoffkonzentrationen Boden'!P60","v":""},{"$f":"'Schadstoffkonzentrationen Boden'!Q60","v":""},{"$f":"'Schadstoffkonzentrationen Boden'!R60","v":""},{"$f":"'Schadstoffkonzentrationen Boden'!S60","v":""},{"$f":"'Schadstoffkonzentrationen Boden'!T60","v":""},{"$f":"'Schadstoffkonzentrationen Boden'!U60","v":""}]
["Oxigenate",{"$f":"'Schadstoffkonzentrationen Boden'!B73","v":""},{"$f":"'Schadstoffkonzentrationen Boden'!C73","v":""},{"$f":"'Schadstoffkonzentrationen Boden'!D73","v":""},{"$f":"'Schadstoffkonzentrationen Boden'!E73","v":""},{"$f":"'Schadstoffkonzentrationen Boden'!F73","v":""},{"$f":"'Schadstoffkonzentrationen Boden'!G73","v":""},{"$f":"'Schadstoffkonzentrationen Boden'!H73","v":""},{"$f":"'Schadstoffkonzentrationen Boden'!I73","v":""},{"$f":"'Schadstoffkonzentrationen Boden'!J73","v":""},{"$f":"'Schadstoffkonzentrationen Boden'!K73","v":""},{"$f":"'Schadstoffkonzentrationen Boden'!L73","v":""},{"$f":"'Schadstoffkonzentrationen Boden'!M73","v":""},{"$f":"'Schadstoffkonzentrationen Boden'!N73","v":""},{"$f":"'Schadstoffkonzentrationen Boden'!O73","v":""},{"$f":"'Schadstoffkonzentrationen Boden'!P73","v":""},{"$f":"'Schadstoffkonzentrationen Boden'!Q73","v":""},{"$f":"'Schadstoffkonzentrationen Boden'!R73","v":""},{"$f":"'Schadstoffkonzentrationen Boden'!S73","v":""},{"$f":"'Schadstoffkonzentrationen Boden'!T73","v":""},{"$f":"'Schadstoffkonzentrationen Boden'!U73","v":""}]
["n-Alkane",{"$f":"'Schadstoffkonzentrationen Boden'!B68","v":""},{"$f":"'Schadstoffkonzentrationen Boden'!C68","v":""},{"$f":"'Schadstoffkonzentrationen Boden'!D68","v":""},{"$f":"'Schadstoffkonzentrationen Boden'!E68","v":""},{"$f":"'Schadstoffkonzentrationen Boden'!F68","v":""},{"$f":"'Schadstoffkonzentrationen Boden'!G68","v":""},{"$f":"'Schadstoffkonzentrationen Boden'!H68","v":""},{"$f":"'Schadstoffkonzentrationen Boden'!I68","v":""},{"$f":"'Schadstoffkonzentrationen Boden'!J68","v":""},{"$f":"'Schadstoffkonzentrationen Boden'!K68","v":""},{"$f":"'Schadstoffkonzentrationen Boden'!L68","v":""},{"$f":"'Schadstoffkonzentrationen Boden'!M68","v":""},{"$f":"'Schadstoffkonzentrationen Boden'!N68","v":""},{"$f":"'Schadstoffkonzentrationen Boden'!O68","v":""},{"$f":"'Schadstoffkonzentrationen Boden'!P68","v":""},{"$f":"'Schadstoffkonzentrationen Boden'!Q68","v":""},{"$f":"'Schadstoffkonzentrationen Boden'!R68","v":""},{"$f":"'Schadstoffkonzentrationen Boden'!S68","v":""},{"$f":"'Schadstoffkonzentrationen Boden'!T68","v":""},{"$f":"'Schadstoffkonzentrationen Boden'!U68","v":""}]
[]
["LCKW",{"$f":"_xlfn.RANK.EQ(B1,$B1:$U1)","v":{"$error":"#VALUE!"}},{"$f":"_xlfn.RANK.EQ(C1,$B1:$U1)","v":{"$error":"#VALUE!"}},{"$error":"#VALUE!"},{"$error":"#VALUE!"},{"$error":"#VALUE!"},{"$error":"#VALUE!"},{"$error":"#VALUE!"},{"$error":"#VALUE!"},{"$error":"#VALUE!"},{"$error":"#VALUE!"},{"$error":"#VALUE!"},{"$error":"#VALUE!"},{"$error":"#VALUE!"},{"$error":"#VALUE!"},{"$error":"#VALUE!"},{"$error":"#VALUE!"},{"$error":"#VALUE!"},{"$error":"#VALUE!"},{"$error":"#VALUE!"},{"$error":"#VALUE!"}]
{"$rows_left_out":4}
{"sheet":"Schadstoffkonzentrationen GW","index":3,"n_rows":57,"n_cols":27,"rows_kept":57,"cut":false,"hidden":true,"merged":[[1,8,1,9],[4,21,6,21],[4,22,5,22],[4,23,5,23],[6,0,6,20],[4,30,5,30],[4,31,5,31],[2,0,2,3],[41,0,41,21],[49,0,49,21],[4,28,5,28],[4,29,5,29],[4,24,5,24],[4,25,5,25],[4,26,5,26],[2,8,2,9],[21,0,21,21]]}
[]
[]
["  Schadstoffkonzentrationen im Grundwasser (gelöst) [µg/L]",null,null,null,null,null,null,null,"Korrekturfaktor",null,10,null,null,null,null,null,null,null,null,null,null,null,null,null,null,{"$f":"Schadstoffbelastung!$J$6*Schadstoffbelastung!$J$9*Bodencharakterisierung!$E$8/1000/1000","v":2.4116400000000001E-3},{"$f":"Schadstoffbelastung!$J$6*Schadstoffbelastung!$J$9*Bodencharakterisierung!E11*Bodencharakterisierung!$E$9/1000/1000","v":5.5358099999999994E-5}]
[]
["Messstelle Nr.",1,2,3,4,5,6,7,8,9,10,11,12,13,14,15,16,17,18,19,20,"Summe Inventar [kg]",null,null," Mittlere Konz. (MW) [µg/L]"," Inventar  (gelöst) [kg]"," Inventar (sorbiert) [kg]"]
["Bezeichnung","GWM 23-12","P7","GWM 12-05","GWM 22-08","GWM 10","GWM 13-05","GWM 24-14","GWM 27-14","GWM 28-14","GWM 16-06","GWM 29-14","GWM 25-14","GWM 26-14","GWM 11-05","GWM 15-06","GWM 14-06"]
{"$rows_left_out":52}
{"sheet":"Bodencharakterisierung","index":4,"n_rows":18,"n_cols":19,"rows_kept":18,"cut":false,"hidden":true,"merged":[[0,0,0,20],[1,14,1,18],[1,1,2,1],[1,0,2,0],[1,3,2,3],[1,12,2,12],[1,11,2,11],[1,13,2,13]]}
[]
[null,"Parameter",null,"Einheit","Hauptbodenart","Nebenbodenart",null,null,null,null,null,null,"Parameter","Einheit","Datenbank"]
[null,null,null,null,null,null,null,null,null,null,null,null,null,null,"Grobsand","Mittelsand","Feinsand","Schluff","Ton"]
[null,"Relativer Anteil (geschätzt)",null,"%",95,{"$f":"100-E4","v":5},null,null,{"$f":"O4","v":"Grobsand"},null,null,null,"Parameter","Einheit","Grobsand","Mittelsand","Feinsand","Schluff","Ton"]
[null,"Wassersättigung (ungesättigter Boden)","SW","-",0.26,0.26,null,null,{"$f":"P4","v":"Mittelsand"},null,null,null,"Wassersättigung (ungesättigter Boden)","-",0.26,0.26,0.26,0.27,0.28999999999999998]
[null,"Durchlässigkeitsbeiwert (kf)","kf","m/s",1E-4,2.0000000000000001E-4,null,{"$f":"F6/E6","v":2},{"$f":"Q4","v":"Feinsand"},null,null,null,"Durchlässigkeitsbeiwert (kf)","m/s",2.0000000000000001E-4,2.7500000000000002E-4,1.0000000000000001E-5,9.9999999999999995E-8,9.9999999999999994E-12]
{"$rows_left_out":13}
{"sheet":"Grundwassercharakterisierung","index":5,"n_rows":15,"n_cols":7,"rows_kept":15,"cut":false,"hidden":true,"merged":[[0,0,0,21]]}
[]
[null,"Parameter","Einheit","Wert"]
[null,"Mittlerer hydraulischer Gradient (I)","%",0.1]
[null,"Grundwasserabstandsgeschwindigkeit (va)","m/d",{"$f":"Bodencharakterisierung!E6*(Grundwassercharakterisierung!D3/100)/Bodencharakterisierung!E7*3600*24","v":4.3200000000000002E-2}]
[null,"Redoxmilieu (charakteristische Mittelwerte)"]
[null,"pH-Wert","--",6.6,null,null,7]
{"$rows_left_out":10}
{"sheet":"Sanierungsdesign","index":6,"n_rows":17,"n_cols":22,"rows_kept":17,"cut":false,"hidden":true,"merged":[[0,0,0,19],[7,0,7,4],[2,0,2,4],[1,18,1,21],[1,16,1,17]]}
[]
[null,"Parameter",null,"Einheit","Wert",null,null,null,null,null,null,null,null,null,null,null,"NOD",null,"Intraparticle Parameters"]
["Sanierungszielwert",null,null,null,null,null,null,null,null,null,null,null,null,null,null,null,"Permang.","Persulf.","fOC(P) ","ρ(P)","n(P)","tf(P)"]
[null,"Sanierungszielwert ","LCKW","µg/L",450,null,null,null,null,null,20,"Persulfat","LCKW",null,null,"Bodenart","g MnO4-/kg","g S2O8-2/kg","-","kg/m³","-","-"]
[null,"Sanierungszielwert ","AKW","µg/L",null,null,null,null,null,null,50,"Permanganat","AKW",null,null,"Grobsand",0.1,0.1,4.1000000000000003E-3,2709,1.0999999999999999E-2,90.909090909090921]
[null,"Sanierungszielwert ","Oxigenate","µg/L",null,null,null,null,null,null,100,null,"n-Alkane",null,null,"Mittelsand",1,0.1,0.1,2709,1.0999999999999999E-2,90.909090909090921]
{"$rows_left_out":12}
{"sheet":"Schadstoffbelastung","index":7,"n_rows":47,"n_cols":28,"rows_kept":47,"cut":false,"hidden":true,"merged":[[1,20,2,20],[1,21,2,21],[1,22,2,22],[1,23,2,23],[1,25,2,25],[1,24,2,24],[10,6,11,7],[1,11,2,12],[1,13,2,13],[1,14,2,14],[1,15,2,15],[1,17,2,17],[1,9,2,9],[0,0,0,14],[1,8,2,8],[1,3,2,3],[1,1,2,1],[1,6,2,7],[1,16,2,16]]}
[]
[null,"Schadstoff",null,"Inventar \n[kg]",null,null,"Geometrie des Schadensherdes",null,"Einheit","Wert",null," Schadstoffstatistik",null,"Einheit","LCKW","AKW",{"$f":"Stoffdatenbank!A37","v":"n-Alkane"},"Oxigenate",null,null,"Mittl. Konz. (GW) [µg/L]","Mittl. Konz. (GW) [µmol/L]","Ci [µg/L]","Grenzkonz. Boden [mg/kg]","Mittlere Konz. Boden [mg/kg]","Residualphase [mg/kg]"]
[null,null,null,null,null,null,null,null,null,null,null,null,null,null,null,null,null,false,false]
[null,"Tetrachlorethen","PCE",{"$f":"IF($S$3,'Schadstoffkonzentrationen Boden'!Z27,'Schadstoffkonzentrationen GW'!V8)","v":316.705306995},null,null,"Mittlere Länge (Schadensherd)",null,"m",42,null," Minimum",null,"mg/kg OS",{"$f":"IF($S$3,'Schadstoffkonzentrationen Boden'!$W$93,\"\")","v":""},{"$f":"IF($S$3,'Schadstoffkonzentrationen Boden'!$W$113,\"\")","v":""},{"$f":"IF($S$3,'Schadstoffkonzentrationen Boden'!$W$121,\"\")","v":""},{"$f":"IF($S$3,'Schadstoffkonzentrationen Boden'!$W$126,\"\")","v":""},null,"PCE",{"$f":"'Schadstoffkonzentrationen GW'!Y8","v":1417.625},{"$f":"IFERROR(U4/Stoffdatenbank!R6,0)","v":8.5399096385542173},{"$f":"IFERROR(Stoffdatenbank!N6*1000*(Schadstoffbelastung!V4/(Schadstoffbelastung!V$17)),0)","v":125771.49355569556},{"$f":"W4/1000*Bodencharakterisierung!$E$9*Stoffdatenbank!J6","v":226.38868840025202},{"$f":"IFERROR(D4*1000/$J$12,0)","v":28.605146039603962},{"$f":"MAX(0,Y4-X4)","v":0},null,{"$f":"D4/VLOOKUP(Schadstoffbelastung!B4,Stoffdatenbank!$A$6:$S$47,17,FALSE)/1000","v":0.19501558312499997}]
[null,"Trichlorethen","TCE",{"$f":"IF($S$3,'Schadstoffkonzentrationen Boden'!Z28,'Schadstoffkonzentrationen GW'!V9)","v":4.4738148656250001},null,null,"Mittlere Breite (Schadensherd)",null,"m",58,null," Maximum",null,"mg/kg OS",{"$f":"IF($S$3,'Schadstoffkonzentrationen Boden'!$X$93,\"\")","v":""},{"$f":"IF($S$3,'Schadstoffkonzentrationen Boden'!$X$113,\"\")","v":""},{"$f":"IF($S$3,'Schadstoffkonzentrationen Boden'!$X$121,\"\")","v":""},{"$f":"IF($S$3,'Schadstoffkonzentrationen Boden'!$X$126,\"\")","v":""},null,"TCE",{"$f":"'Schadstoffkonzentrationen GW'!Y9","v":46.5625},{"$f":"IFERROR(U5/Stoffdatenbank!R7,0)","v":0.35543893129770993},{"$f":"IFERROR(Stoffdatenbank!N7*1000*(Schadstoffbelastung!V5/(Schadstoffbelastung!V$17)),0)","v":32717.036207950969},{"$f":"W5/1000*Bodencharakterisierung!$E$9*Stoffdatenbank!J7","v":21.266073535168129},{"$f":"IFERROR(D5*1000/$J$12,0)","v":0.40407951732673275},{"$f":"MAX(0,Y5-X5)","v":0},null,{"$f":"D5/VLOOKUP(Schadstoffbelastung!B5,Stoffdatenbank!$A$6:$S$47,17,FALSE)/1000","v":3.0554670575228793E-3}]
[null,"cis-1,2-Dichlorethen","cDCE",{"$f":"IF($S$3,'Schadstoffkonzentrationen Boden'!Z29,'Schadstoffkonzentrationen GW'!V10)","v":6.4291102312499993},null,null,"Fläche der Belastung",null,"m²",{"$f":"J4*J5","v":2436},null," Median",null,"mg/kg OS",{"$f":"IF($S$3,'Schadstoffkonzentrationen Boden'!$Y$93,\"\")","v":""},{"$f":"IF($S$3,'Schadstoffkonzentrationen Boden'!$Y$113,\"\")","v":""},{"$f":"IF($S$3,'Schadstoffkonzentrationen Boden'!$Y$121,\"\")","v":""},{"$f":"IF($S$3,'Schadstoffkonzentrationen Boden'!$Y$126,\"\")","v":""},null,"cDCE",{"$f":"'Schadstoffkonzentrationen GW'!Y10","v":124.125},{"$f":"IFERROR(U6/Stoffdatenbank!R8,0)","v":1.2796391752577319},{"$f":"IFERROR(Stoffdatenbank!N8*1000*(Schadstoffbelastung!V6/(Schadstoffbelastung!V$17)),0)","v":412253.67117238219},{"$f":"W6/1000*Bodencharakterisierung!$E$9*Stoffdatenbank!J8","v":103.06341779309555},0.58068378712871282,0,null,{"$f":"D6/VLOOKUP(Schadstoffbelastung!B6,Stoffdatenbank!$A$6:$S$47,17,FALSE)/1000","v":5.0082653511334414E-3}]
{"$rows_left_out":42}
{"sheet":"Calculation","index":8,"n_rows":11,"n_cols":9,"rows_kept":11,"cut":false,"hidden":true,"merged":[[9,0,9,4],[1,5,1,6],[2,0,2,4],[2,5,2,8],[13,5,15,7],[13,8,15,8],[10,0,12,1],[10,3,12,3],[10,4,12,4],[10,5,12,6],[10,7,12,7],[10,8,12,8],[9,5,9,8]]}
[]
[null,"Parameter",null,"Einheit","Wert","  Ergebnisparameter",null,"Einheit","Wert"]
["Schadstoffbelastung",null,null,null,null,"Dimensionierung Injektionen"]
[null,"Soil Oxygen Demand (SOD)","SOD","g/kg",{"$f":"Sanierungsdesign!E14","v":2}," Injektionen unproduktiver Oxidationsmittelverbrauch",null,"Kampagnen",{"$f":"Berechnung1!C23","v":1}]
[null,"Relevante Konzentration Grundwasser","Cw","µg/L",{"$f":"Berechnung1!C14","v":1633.5625}," Injektionen für Schadstoffabbau",null,"Kampagnen",{"$f":"VLOOKUP(I11,Berechnung1!E5:AS47,40,0)","v":2.9968607065153572}]
[null,"Mittlere Konzentration Boden","Cges"," mg/kg",{"$f":"Berechnung1!C15","v":29.825800200495053}," Gesamtinjektionen für betrachteten Stoff",null,"Kampagnen",{"$f":"I4+I5","v":3.9968607065153572}]
{"$rows_left_out":6}
{"sheet":"Berechnung1","index":9,"n_rows":47,"n_cols":47,"rows_kept":47,"cut":false,"hidden":true,"merged":[[0,40,2,40],[0,41,2,41],[0,35,2,35],[0,36,2,36],[0,37,2,37],[0,38,2,38],[0,39,2,39],[0,30,2,30],[0,31,2,31],[0,32,2,32],[0,33,2,33],[0,34,2,34],[0,46,2,46],[0,44,2,44],[0,45,2,45],[0,42,2,42],[0,43,2,43]]}
["Bewertungsrelevanter Schadstoff",null,{"$f":"OFFSET(E5,MATCH(\"Ja\",T5:T47,0)-1,0)","v":{"$error":"#N/A"}},null,null,null,null,null,null,"Ermittlung bewertungsrelevanter Schadstoff",null,null,null,null,null,null,null,null,null,null,null,null,null,null,null,null,null,null,null,null,"Ges. Ox-Bedarf [kg/kgBoden]","NAPL-Auflösung \nFb [kg/m2*s]","Massentransferrate JRW=Fb * A0 [kg/m³*s]","Mass of contaminant [kg]","Time for blobs dissolution [d]","KOC [L/kg]","Rf [-]","Dp [m2/s]","Dap [m2/s]","Desorptionszeit Test 1 [d]","Zielwerte [µg/L]","Retardations-faktor R","Konz. im GW nach 1. Test [µg/L]","1 + Erforderliche Anzahl injektionen","Erforderliche Gesamtzahl injektionen","Schadstoffendkonzentration","Sanierungs-dauer [d]"]
["Betrachteter Stoff:",null,{"$f":"IF(Sanierungsdesign!E16=\"Bewertungsrelevanter Schadstoff\",C1,Sanierungsdesign!E16)","v":"LCKW"},null,null,"Gesamt","Konz im Boden","wäss. Konz","wässrige Konz.",null,"Stoffmenge","Anteil an","Mengen-","K(d)","Löslichkeit","San.Zielwert","Verhältnis","Sanierungs-","Auswahl-","Maximum +","Dichte","Diff.-Koeff.","Grenzkonz.","Mittel.Konz","Residualph.","Sätt.Konz.","Stöchiomet. Faktor","Stöchiomet. Faktor","Welcher Stoff","Welcher Stoff"]
["Oxidationsmittel",null,{"$f":"Sanierungsdesign!E15","v":"Permanganat"},null,"Stoffname","Inventar [kg]","mg/kg","c(w) [kg/m3]","im Gleichgewicht","Molgewicht",null,"Stofgruppe","relevanz?","m3/kg","[kg/m3]","[kg/m3]","c(w)/Zielw.","relevanz?","Formel","bew.Relevanz","kg/L","m²/s","Boden [kg/kg]","Boden [kg/kg]","Boden [kg/kg]","c(i) [kg/m3]","Permang. [g MnO4-/g]","Permang. [g S2O8-2/g]","betrachtet","betrachtet"]
[null,null,null,null,1,{"$f":"E4+1","v":2},{"$f":"F4+1","v":3},4,5,6,7,8,9,10,11,12,13,14,15,16,17,18,19,20,21,22,23,24,25,26,27,28,29,30,31,32,33,34,35,36,37,38,39,40,41,42,43]
["Oxidationsmittelbedarf durch SOD [g/kg] aus Bodenart abgeschätzt",null,{"$f":"Sanierungsdesign!E14","v":2},null,"Tetrachlorethen",{"$f":"Schadstoffbelastung!D4","v":316.705306995},{"$f":"F5/Schadstoffbelastung!$J$12*1000","v":28.605146039603962},{"$f":"Schadstoffbelastung!U4/1000/1000","v":1.4176249999999998E-3},{"$f":"X5/N5","v":1.589174779977998E-2},{"$f":"Stoffdatenbank!R6","v":166},{"$f":"F5/J5","v":1.9078632951506025},{"$f":"IFERROR(K5/$K$18,0)","v":0.93158398940669096},{"$f":"IF(L5>0.05,1,0)","v":1},{"$f":"Stoffdatenbank!J6*0.001*Bodencharakterisierung!$E$9","v":1.8E-3},{"$f":"Stoffdatenbank!N6*0.001","v":0.16},{"$f":"Sanierungsdesign!$E$4/1000000","v":4.4999999999999999E-4},{"$f":"H5/P5","v":3.1502777777777773},{"$f":"IF(AND(M5=1,Q5>1),1,0)","v":1},{"$f":"IF((R5=1),((Q5)^0.5*N5)/((0.15^1.2)*(O5^0.9)),0)","v":0.16196808024995241},{"$f":"IF((S5=MAX($S$5:$S$46)),\"Ja\",\"0\")","v":{"$error":"#DIV/0!"}},{"$f":"Stoffdatenbank!Q6","v":1.6240000000000001},{"$f":"Stoffdatenbank!L6","v":7.49E-10},{"$f":"Schadstoffbelastung!X4/1000/1000","v":2.2638868840025203E-4},{"$f":"Schadstoffbelastung!Y4/1000/1000","v":2.8605146039603965E-5},{"$f":"Schadstoffbelastung!Z4/1000/1000","v":0},{"$f":"Schadstoffbelastung!W4/1000/1000","v":0.12577149355569556},0.96,1,{"$f":"IF($C$2=E5,1,0)","v":0},{"$f":"IF($C$2=F5,1,0)","v":0},{"$f":"IF(Sanierungsdesign!$E$15=\"Permanganat\",Berechnung1!F5*Berechnung1!AA5,Berechnung1!F5*Berechnung1!AB5)","v":304.0370947152},{"$f":"VLOOKUP(E5,Stoffdatenbank!$A$6:$R$47,Stoffdatenbank!$L$2,FALSE)/(Bodencharakterisierung!$E$13/10)*VLOOKUP(E5,Stoffdatenbank!$A$6:$R$47,Stoffdatenbank!$N$2,FALSE)/1000","v":2075161.4457831325},{"$f":"AF5*$C$7","v":1024370.7416098774},{"$f":"VLOOKUP(E5,Schadstoffbelastung!$B$2:$D$46,3,0)","v":316.705306995},{"$f":"IF(Y5>0,Schadstoffbelastung!$J$4/Grundwassercharakterisierung!$D$4*AP5,0)*Heterogenität!$D$17","v":0},{"$f":"Stoffdatenbank!J6*Bodencharakterisierung!$E$9","v":1.8},{"$f":"1+AJ5*VLOOKUP(E5,Stoffdatenbank!$A$6:$S$47,Stoffdatenbank!$Q$2,FALSE)/Bodencharakterisierung!$E$8","v":1.0000361090909091},{"$f":"Stoffdatenbank!L6/Bodencharakterisierung!$E$14","v":9.3625E-11},{"$f":"AL5/AK5","v":9.362161940843372E-11},{"$f":"0.183*Bodencharakterisierung!$E$13^2/Berechnung1!AM5*Heterogenität!$D$17/3600/24","v":4.7874631979464245E-3},{"$f":"Sanierungsdesign!$E$4","v":450},{"$f":"1+U5*1000*(AH5/U5/1000/Schadstoffbelastung!$J$11/Bodencharakterisierung!$E$8)/O5/lblMainSoilPorosityAct","v":5.1038632812499998},{"$f":"G5/AJ5*1000*0.4","v":6356.6991199119911},{"$f":"IFERROR(LOG(AO5/AQ5,0.4),0)","v":2.8899309361343066},{"$f":"IF(F5=0,0,IF(AR5<0,1,1+ROUNDUP(AR5,0)))","v":4},{"$f":"G5/AJ5*1000*0.4^AS5","v":406.82874367436762},{"$f":"(AS5*90)*Heterogenität!$D$17+AI5+AN5","v":442.33902671292509}]
["Relative Porensättigung mit NAPL (S0)","m³/m³",{"$f":"SUM(Schadstoffbelastung!AB4:AB45)/Schadstoffbelastung!J11/Bodencharakterisierung!E8","v":8.5357587203628389E-5},null,"Trichlorethen",{"$f":"Schadstoffbelastung!D5","v":4.4738148656250001},{"$f":"F6/Schadstoffbelastung!$J$12*1000","v":0.40407951732673275},{"$f":"Schadstoffbelastung!U5/1000/1000","v":4.65625E-5},6.2166079588728111E-4,{"$f":"Stoffdatenbank!R7","v":131},{"$f":"F6/J6","v":3.4151258516221375E-2},{"$f":"IFERROR(K6/$K$18,0)","v":1.6675600255357578E-2},0,{"$f":"Stoffdatenbank!J7*0.001*Bodencharakterisierung!$E$9","v":6.5000000000000008E-4},{"$f":"Stoffdatenbank!N7*0.001","v":1},{"$f":"Sanierungsdesign!$E$4/1000000","v":4.4999999999999999E-4},0.10347222222222223,0,0,{"$f":"IF((S6=MAX($S$5:$S$46)),\"Ja\",\"0\")","v":{"$error":"#DIV/0!"}},{"$f":"Stoffdatenbank!Q7","v":1.4641999999999999},{"$f":"Stoffdatenbank!L7","v":8.08E-10},{"$f":"Schadstoffbelastung!X5/1000/1000","v":2.1266073535168127E-5},{"$f":"Schadstoffbelastung!Y5/1000/1000","v":4.0407951732673274E-7},{"$f":"Schadstoffbelastung!Z5/1000/1000","v":0},{"$f":"Schadstoffbelastung!W5/1000/1000","v":3.2717036207950967E-2},1.81,1,0,0,{"$f":"IF(Sanierungsdesign!$E$15=\"Permanganat\",Berechnung1!F6*Berechnung1!AA6,Berechnung1!F6*Berechnung1!AB6)","v":8.0976049067812497},{"$f":"VLOOKUP(E6,Stoffdatenbank!$A$6:$R$47,Stoffdatenbank!$L$2,FALSE)/(Bodencharakterisierung!$E$13/10)*VLOOKUP(E6,Stoffdatenbank!$A$6:$R$47,Stoffdatenbank!$N$2,FALSE)/1000","v":824325.30120481923},{"$f":"AF6*$C$7","v":406915.1929546849},{"$f":"VLOOKUP(E6,Schadstoffbelastung!$B$2:$D$46,3,0)","v":4.4738148656250001},{"$f":"IF(Y6>0,Schadstoffbelastung!$J$4/Grundwassercharakterisierung!$D$4*AP6,0)*Heterogenität!$D$17","v":0},{"$f":"Stoffdatenbank!J7*Bodencharakterisierung!$E$9","v":0.65},{"$f":"1+AJ6*VLOOKUP(E6,Stoffdatenbank!$A$6:$S$47,Stoffdatenbank!$Q$2,FALSE)/Bodencharakterisierung!$E$8","v":1.0000140242424242},{"$f":"Stoffdatenbank!L7/Bodencharakterisierung!$E$14","v":1.01E-10},{"$f":"AL6/AK6","v":1.0099858357137948E-10},{"$f":"0.183*Bodencharakterisierung!$E$13^2/Berechnung1!AM6*Heterogenität!$D$17/3600/24","v":4.4377855767972841E-3},{"$f":"Sanierungsdesign!$E$4","v":450},{"$f":"1+U6*1000*(AH6/U6/1000/Schadstoffbelastung!$J$11/Bodencharakterisierung!$E$8)/O6/lblMainSoilPorosityAct","v":1.0092754616477273},{"$f":"G6/AJ6*1000*0.4","v":248.6643183549125},{"$f":"IFERROR(LOG(AO6/AQ6,0.4),0)","v":-0.6473313482862133},{"$f":"IF(F6=0,0,IF(AR6<0,1,1+ROUNDUP(AR6,0)))","v":1},{"$f":"G6/AJ6*1000*0.4^AS6","v":248.6643183549125},{"$f":"(AS6*90)*Heterogenität!$D$17+AI6+AN6","v":110.58799759800858}]
{"$rows_left_out":42}
{"sheet":"Stoffdatenbank","index":10,"n_rows":56,"n_cols":22,"rows_kept":56,"cut":false,"hidden":true,"merged":[[4,0,4,18],[18,0,18,18],[36,0,36,18],[43,0,43,18],[0,0,0,19]]}
[]
[1,2,3,null,null,null,null,4,5,6,7,8,9,10,11,12,13,14]
[null,"Abbaurate (Permang.)","Abbaurate (Sufat-Radikal)","Abbaurate (ERD)","Abbaurate (O2)","Abbaurate (Nitrat)","Abbaurate (Sulfat)"," Ver-dampfungs-enthalpie","Gemisch-siedetemp. mit Wasser","Sorptions-koeffizient","Henry-Koeffizient","Diffusions-koeffizient (in Wasser)","Diffusions-koeffizient (in Luft)","Löslichkeit","Dampf-druck","Siede-punkt","Dichte ","Molekular-gewicht",null,null,"Abbaurate (Permang.)","Abbaurate (Sufat-Radikal)"]
["Verbindung","lPM \n[mol-1 s-1]","lPM \n[mol-1 s-1]","lERD \n[d-1]","lOx \n[d-1]","lNO3 \n[d-1]","lSO4 \n[d-1]"," ΔHv \n[kJ/kg]","\n°C","KOC \n[L/kg]","H (15°C) \n[-]","Dw (15°C) \n[m²/s]","Da (15°C) \n[m²/s]","Lw (20°C) \n[mg/L]","Po (15°C) \n[Pa]","\n°C","\n[kg/L]","Mm \n[g/mol]","Bemerkung",null,"lPM \n[mol-1 s-1]","lPM \n[mol-1 s-1]"]
["Leichtflüchtige chlorierte Kohlenwasserstoffe (LCKW)"]
["Tetrachlorethen",3.7999999999999999E-2,44,2.8000000000000001E-2,"--","--","--",239.22,88.7,{"$f":"0.36*1000","v":360},0.64,7.49E-10,6.6200000000000001E-6,160,1479,121.075,1.6240000000000001,166,null,null,3.7999999999999999E-2,44]
{"$rows_left_out":51}
{"sheet":"Heterogenität","index":11,"n_rows":20,"n_cols":7,"rows_kept":20,"cut":false,"hidden":true,"merged":[[15,0,15,1],[16,0,16,1]]}
[null,null,null,null,null,"Sondierung","Gini-Koeffizient"]
[]
[]
[]
[]
[]
{"$rows_left_out":14}